Oxacyclohexadecan-2-one, 16-methyl-

Normal alkane RI, polar column, custom temperature program

Data compiled by: NIST Mass Spectrometry Data Center, William E. Wallace, director

Column type CapillaryCapillaryCapillaryCapillary
Active phase Innowax FSCHP-Innowax FSCHP-Innowax FSCHP-Innowax
Column length (m) 60.60.60.60.
Carrier gas N2HeN2He
Substrate
Column diameter (mm) 0.250.250.250.25
Phase thickness (μm) 0.250.250.250.25
Program 60C(10min) => 4C/min => 220C(10min) => 1C/min => 240C60C(10min) => 4C/min => 220C(10min) => 1C/min => 240C(40min)60C(10min) => 4C/min => 220C(10min) => 1C/min => 240C60 0C (10 min) 4 K/min -> 220 0C (10 min) 1 K/min -> 240 0C
I 2260.2260.2260.2260.
ReferenceIscan, Kirimer, et al., 2006Kürkcüoglu, Demirci, et al., 2003Hüsnü Can Baser, Demirci, et al., 2002Gören, Demirci, et al., 2001
Comment MSDC-RI MSDC-RI MSDC-RI MSDC-RI

References

Iscan, Kirimer, et al., 2006
Iscan, G.; Kirimer, N.; Kurkcuoglu, M.; Arabaci, T.; Kupeli, E.; Baser, K.H.C., Biological Activity and Composition of the Essential Oils of Achillea schischkinii Sosn. and Achillea aleppica DC. subsp. aleppica, J. Agric. Food Chem., 2006, 54, 1, 170-173, https://doi.org/10.1021/jf051644z . [all data]

Kürkcüoglu, Demirci, et al., 2003
Kürkcüoglu, M.; Demirci, B.; Tabanca, N.; Özek, T.; Baser, K.H.C., The essential oil of Achillea falcata L., Flavour Fragr. J., 2003, 18, 3, 192-194, https://doi.org/10.1002/ffj.1176 . [all data]

Hüsnü Can Baser, Demirci, et al., 2002
Hüsnü Can Baser, K.; Demirci, B.; Femirci, F.; Kocak, S.; Akinci, C.; Malyer, H.; Güleryüz, G., Composition and antimicrobial activity of the essential oil of Achellea multifida, Planta Medica, 2002, 68, 10, 941-943, https://doi.org/10.1055/s-2002-34923 . [all data]

Gören, Demirci, et al., 2001
Gören, N.; Demirci, B.; Baser, K.H.C., Composition of the essential oils of Tanacetum spp. from Turkey, Flavour Fragr. J., 2001, 16, 3, 191-194, https://doi.org/10.1002/ffj.976 . [all data]