Ethyl (methylthio)acetate

Van Den Dool and Kratz RI, non-polar column, custom temperature program

Data compiled by: NIST Mass Spectrometry Data Center, William E. Wallace, director

Column type CapillaryCapillary
Active phase DB-5BPX-5
Column length (m) 30.50.
Carrier gas HeHe
Substrate
Column diameter (mm) 0.250.32
Phase thickness (μm) 0.250.50
Program 50C (1min) => 5C/min => 100C => 10C/min => 250C (9min)0 0C (8 min) -> (1 min) -> 50 0C (2 min) 2.5 0C/min -> 100 0C 6 0C/min -> 250 0C
I 981.990.
ReferenceBeaulieu and Grimm, 2001Bauchot, Mottram, et al., 1998
Comment MSDC-RI MSDC-RI

Kovats' RI, polar column, temperature ramp

Data compiled by: NIST Mass Spectrometry Data Center, William E. Wallace, director

Column type CapillaryCapillary
Active phase BP-20Carbowax 20M
Column length (m) 25.150.
Carrier gas  He
Substrate
Column diameter (mm) 0.320.64
Phase thickness (μm)
Tstart (C) 70.50.
Tend (C) 200.170.
Heat rate (K/min) 4.1.
Initial hold (min) 2.
Final hold (min)
I 1484.1430.
ReferenceWyllie and Leach, 1990Buttery, Seifert, et al., 1982
Comment MSDC-RI MSDC-RI

Normal alkane RI, polar column, custom temperature program

Data compiled by: NIST Mass Spectrometry Data Center, William E. Wallace, director

Column type Capillary
Active phase DB-Wax
Column length (m) 30.
Carrier gas Helium
Substrate
Column diameter (mm) 0.25
Phase thickness (μm) 0.25
Program not specified
I 1450.
ReferenceWelke, Manfroi, et al., 2012
Comment MSDC-RI

References

Beaulieu and Grimm, 2001
Beaulieu, J.C.; Grimm, C.C., Identification of volatile compounds in cantaloupe at various developmental stages using solid phase microextraction, J. Agric. Food Chem., 2001, 49, 3, 1345-1352, https://doi.org/10.1021/jf0005768 . [all data]

Bauchot, Mottram, et al., 1998
Bauchot, A.D.; Mottram, D.S.; Dodson, A.T.; John, P., Effect of aminocyclopropane-1-carboxylic acid oxidase antisense gene on the formation of volatile esters in cantaloupe charentais melon (Cv. Védrandais), J. Agric. Food Chem., 1998, 46, 11, 4787-4792, https://doi.org/10.1021/jf980692z . [all data]