2H-Pyran, 3,4-dihydro-2-methoxy-

Reaction thermochemistry data

Data compiled by: Hussein Y. Afeefy, Joel F. Liebman, and Stephen E. Stein

Individual Reactions

Hydrogen + 2H-Pyran, 3,4-dihydro-2-methoxy- = 2H-Pyran, tetrahydro-2-methoxy-

By formula: H2 + C6H10O2 = C6H12O2

Quantity Value Units Method Reference Comment
Δr-25.89 ± 0.28kcal/molChydAllinger, Glaser, et al., 1981liquid phase; solvent: Hexane

References

Allinger, Glaser, et al., 1981
Allinger, N.L.; Glaser, J.A.; Davis, H.E., Heats of hydrogenation of some vinyl ethers and related compounds, J. Org. Chem., 1981, 46, 658-661. [all data]