1-Butanamine, N,N-dipropyl-

Kovats' RI, non-polar column, isothermal

Data compiled by: NIST Mass Spectrometry Data Center, William E. Wallace, director

Column type CapillaryPackedPackedPacked
Active phase Apiezon L + KFApiezon LApiezon LApiezon
Column length (m) 30.2.72.72.7
Carrier gas
Substrate  Chromosorb G AW (80-100 mesh)Chromosorb G AW (80-100 mesh)
Column diameter (mm) 0.25
Phase thickness (μm) 0.06
Temperature (C) 80.80.80.100.
I 1004.1001.1000.31001.
ReferenceSvetlova, Samusenko, et al., 1986Zhuravleva, Golovnya, et al., 1981Zhuravleva, Golovnya, et al., 1981Golovnya, Zhuravleva, et al., 1976
Comment MSDC-RI MSDC-RI MSDC-RI MSDC-RI

References

Svetlova, Samusenko, et al., 1986
Svetlova, N.I.; Samusenko, A.L.; Golovnya, R.V., Advantage of the universal equation over the linear equation for the calculation of retention parameters of homologous series in capillary chromatography, J. Hi. Res. Chromatogr. Chromatogr. Comm., 1986, 9, 12, 737-740, https://doi.org/10.1002/jhrc.1240091205 . [all data]

Zhuravleva, Golovnya, et al., 1981
Zhuravleva, I.L.; Golovnya, R.V.; Terenina, M.B.; Grigorieva, D.N., Gas chromatographic behaviour of some unsymmetrical tertiary amines, Zh. Anal. Khim., 1981, 36, 968-975. [all data]

Golovnya, Zhuravleva, et al., 1976
Golovnya, R.V.; Zhuravleva, I.L.; Kapustin, Yu.P., Gas chromatographic separation of tertiary isoaliphatic amines on supports treated with trisodium phosphate, Zh. Anal. Khim., 1976, 31, 764-768. [all data]