Furan, 2,2'-[oxybis(methylene)]bis-

Normal alkane RI, polar column, custom temperature program

Data compiled by: NIST Mass Spectrometry Data Center, William E. Wallace, director

Column type Capillary
Active phase DB-Wax
Column length (m) 30.
Carrier gas Hydrogen
Substrate
Column diameter (mm) 0.25
Phase thickness (μm) 0.25
Program 44 0C 3 0C/min -> 170 0C 8 0C/min -> 250 0C
I 1977.
ReferenceGonzalez-Rios, Suarez-Quiroz, et al., 2007
Comment MSDC-RI

References

Gonzalez-Rios, Suarez-Quiroz, et al., 2007
Gonzalez-Rios, O.; Suarez-Quiroz, M.L.; Boulanger, R.; Barel, M.; Guyot, B.; Guiraud, J.-P.; Schorr-Galindo, S., Impact of ecological post-harvest processing of coffee aroma: II Roasted coffee., J. Food Composition Analysis, 2007, 20, 3-4, 297-307, https://doi.org/10.1016/j.jfca.2006.12.004 . [all data]