1H-Purin-6-amine, N-methyl-

Phase change data

Data compiled by: William E. Acree, Jr., James S. Chickos

Enthalpy of sublimation

ΔsubH (kcal/mol) Temperature (K) Method Reference
29.5 ± 5.0395. - 425.MEZielenkiewicz, Zielenkiewicz, et al., 1984

Gas phase ion energetics data

Data compiled by: Sharon G. Lias, Rhoda D. Levin, and Sherif A. Kafafi

Ionization energy determinations

IE (eV) Method Reference Comment
8.15PELin, Yu, et al., 1980Vertical value
8.15PEPeng, Padva, et al., 1976Vertical value
8.39PEPeng, Padva, et al., 1976Vertical value

References

Zielenkiewicz, Zielenkiewicz, et al., 1984
Zielenkiewicz, A.; Zielenkiewicz, W.; Sukhodub, L.F.; Glukhova, O.T.; Tepitsky, A.B.; Wierzchowski, K.L., Thermochemistry of aqueous solutions of alkylated nucleic acid bases. v. Enthalpies of hydration of N-methylated adenines, J. Solution Chem., 1984, 13, 757-765. [all data]

Lin, Yu, et al., 1980
Lin, J.; Yu, C.; Peng, S.; Akiyama, I.; Li, K.; Lee, L.K.; LeBreton, P.R., Ultraviolet photoelectron studies of the ground-state electronic structure and gas-phase tautomerism of purine and adenine, J. Am. Chem. Soc., 1980, 102, 4627. [all data]

Peng, Padva, et al., 1976
Peng, S.; Padva, A.; LeBreton, P.R., Ultraviolet photoelectron studies of biological purines: The valence electronic structure of adenine, Proc. Nat. Acad. Sci. U.S.A., 1976, 73, 2966. [all data]