Butane, 2-isothiocyanato-

Normal alkane RI, polar column, temperature ramp

Data compiled by: NIST Mass Spectrometry Data Center, William E. Wallace, director

Column type Capillary
Active phase HP-20M
Column length (m) 50.
Carrier gas Helium
Substrate
Column diameter (mm) 0.20
Phase thickness (μm) 0.20
Tstart (C) 60.
Tend (C) 220.
Heat rate (K/min) 2.
Initial hold (min)
Final hold (min) 20.
I 1287.
ReferenceBreme, Langle, et al., 2008
Comment MSDC-RI

Kovats' RI, non-polar column, isothermal

View large format table.

Column type Active phase Temperature (C) I Reference Comment
PackedUCW-98120.913.Rajniaková and Floch, 1993N2, Chromosorb WAW DNCS; Column length: 1.8 m

Van Den Dool and Kratz RI, non-polar column, custom temperature program

View large format table.

Column type Active phase I Reference Comment
CapillaryHP-5MS933.3Andriamaharavo, 201430. m/0.25 mm/0.25 μm, He; Program: 60C (1 min) => 5 C/min => 210C => 10 C/min => 280C (15 min)
CapillaryDB-5920.Afsharypuor, Jeiran, et al., 199825. m/0.25 mm/0.25 μm, He; Program: 60C => 3C/min => 106C => 6C/min => 280C

Normal alkane RI, non-polar column, temperature ramp

View large format table.

Column type Active phase I Reference Comment
CapillaryBP-1937.Dehshahri, Afsharypuor, et al., 201230. m/0.25 mm/0.25 μm, Nitrogen, 4. K/min; Tstart: 60. C; Tend: 275. C
CapillaryHP-1904.Breme, Langle, et al., 200850. m/0.20 mm/0.33 μm, Helium, 2. K/min, 250. C @ 20. min; Tstart: 60. C
CapillaryDB-5919.Miyazawa, Nishiguchi, et al., 200530. m/0.25 mm/0.25 μm, He, 3. K/min; Tstart: 60. C; Tend: 240. C
CapillaryCP Sil 5 CB925.Rohloff and Bones, 200530. m/0.25 mm/0.25 μm, He, 40. C @ 1. min, 4. K/min; Tend: 220. C

Normal alkane RI, non-polar column, custom temperature program

View large format table.

Column type Active phase I Reference Comment
CapillaryDB-5920.Afsharypuor and Arefian, 199925. m/0.25 mm/0.25 μm, Helium; Program: 60 0C 3 0C/min -> 106 0C 6 0C/min -> 280 0C

References

Breme, Langle, et al., 2008
Breme, K.; Langle, S.; Fernandez, X.; Meierhenrich, U.J.; Brevard, H.; Joulain, D., Character impact odorants from Brassicaceae by aroma extracts dilution analysis (AEDA): Brassica cretica and Brassica insularis, Flavour Fragr. J., 2008, 24, 2, 88-93, https://doi.org/10.1002/ffj.1912 . [all data]