Cyclobutanecarbonitrile

Gas phase thermochemistry data

Data compiled by: Hussein Y. Afeefy, Joel F. Liebman, and Stephen E. Stein

Quantity Value Units Method Reference Comment
Δfgas147.3 ± 1.1kJ/molCmFuchs and Hallman, 1983
Δfgas143.0kJ/molCcrHall and Baldt, 1971

References

Fuchs and Hallman, 1983
Fuchs, R.; Hallman, J.H., Heats of vaporization of some monosubstituted cyclopropane, cyclobutane, and cyclopentane derivatives. Some observations on the enthalpies of isodesmic ring opening reactions of cyclobutane derivatives, Can. J. Chem., 1983, 61, 503-505. [all data]

Hall and Baldt, 1971
Hall, H.K., Jr.; Baldt, J.H., Thermochemistry of strained-ring bridgehead nitriles and esters, J. Am. Chem. Soc., 1971, 93, 140-145. [all data]