Cyclohexanone, 2-ethyl-

Van Den Dool and Kratz RI, non-polar column, temperature ramp

View large format table.

Column type Active phase I Reference Comment
CapillaryDB-51158.Gómez, Ledbetter, et al., 1993He, 4. K/min; Column length: 30. m; Column diameter: 0.25 mm; Tstart: 50. C; Tend: 250. C

Normal alkane RI, non-polar column, custom temperature program

View large format table.

Column type Active phase I Reference Comment
CapillaryHP-5 MS1158.Bai, Liu, et al., 201130. m/0.25 mm/0.25 μm, Helium; Program: 60 0C (1 min) 10 0C/min -> 180 0C (1 min) 20 0C/min -> 280 0C (15 min)

Normal alkane RI, polar column, temperature ramp

View large format table.

Column type Active phase I Reference Comment
CapillaryDB-Wax1651.Guo, Wu, et al., 200830. m/0.25 mm/0.25 μm, Helium, 60. C @ 2. min, 10. K/min, 250. C @ 10. min

References

Gómez, Ledbetter, et al., 1993
Gómez, E.; Ledbetter, C.A.; Hartsell, P.L., Volatile compounds in apricot, plum, and their interspecific hybrids, J. Agric. Food Chem., 1993, 41, 10, 1669-1676, https://doi.org/10.1021/jf00034a029 . [all data]

Bai, Liu, et al., 2011
Bai, C.Q.; Liu, Z.L.; Liu, Q.Z., Nematicidal constituents from the essential oil of Chenopodium ambrosioides aerial parts, E-Journal of Chemistry, 2011, 8, S1, s143-s148, https://doi.org/10.1155/2011/470862 . [all data]

Guo, Wu, et al., 2008
Guo, L.; Wu, J.-Z.; Han, T.; Cao, T.; Rahman, K.; Qin, L.-P., Chemical composition, antifungal and antitumor properties of ether extracts of Scapania verrucosa Heeg. and its endophytic fungus Chaetomium fusiforme, Molecules, 2008, 13, 9, 2114-2125, https://doi.org/10.3390/molecules13092114 . [all data]