Piperonylonitrile

Phase change data

Data compiled by: William E. Acree, Jr., James S. Chickos

Quantity Value Units Method Reference Comment
Δsub90.9 ± 0.9kJ/molCMatos, Sousa, et al., 2007

Enthalpy of fusion

ΔfusH (kJ/mol) Temperature (K) Method Reference
20.79366.3DSCMatos, Sousa, et al., 2007

References

Matos, Sousa, et al., 2007
Matos, M. Agostinha R.; Sousa, Clara C.S.; Morais, Victor M.F., Experimental and Computational Thermochemistry of 1,3-Benzodioxole Derivatives, J. Chem. Eng. Data, 2007, 52, 3, 1089-1094, https://doi.org/10.1021/je700035m . [all data]