Benzeneboronic acid, cyclic tetramethylene ester

Phase change data

Data compiled by: William E. Acree, Jr., James S. Chickos

Enthalpy of vaporization

ΔvapH (kcal/mol) Temperature (K) Reference
13.7441.Finch, Gardner, et al., 1970

References

Finch, Gardner, et al., 1970
Finch, A.; Gardner, P.J.; McNamara, P.M.; Wellum, G.R., Cyclic boron compounds. Ring strain in the B-phenyl and B-butyl dioxaboron heterocycles, J. Chem. Soc., A, 1970, 3339, https://doi.org/10.1039/j19700003339 . [all data]