Hexane, 1-isothiocyanato-

Van Den Dool and Kratz RI, non-polar column, temperature ramp

Data compiled by: NIST Mass Spectrometry Data Center, William E. Wallace, director

Column type Capillary
Active phase HP-5MS
Column length (m) 30.
Carrier gas He
Substrate
Column diameter (mm) 0.25
Phase thickness (μm) 0.25
Tstart (C) 60.
Tend (C) 275.
Heat rate (K/min) 4.
Initial hold (min)
Final hold (min)
I 1199.
ReferenceAfsharypuor and Suleimany, 2002
Comment MSDC-RI

Kovats' RI, non-polar column, isothermal

Data compiled by: NIST Mass Spectrometry Data Center, William E. Wallace, director

Column type Packed
Active phase UCW-98
Column length (m) 1.8
Carrier gas N2
Substrate Chromosorb WAW DNCS
Column diameter (mm)
Phase thickness (μm)
Temperature (C) 120.
I 1181.2
ReferenceRajniaková and Floch, 1993
Comment MSDC-RI

References

Afsharypuor and Suleimany, 2002
Afsharypuor, S.; Suleimany, M., Volatile oil constituents of Brassica oleracea var. gongylodes seeds, J. Essent. Oil Res., 2002, 14, 1, 18-19, https://doi.org/10.1080/10412905.2002.9699748 . [all data]