Cyclobutyl bromide

Phase change data

Data compiled as indicated in comments:
BS - Robert L. Brown and Stephen E. Stein
TRC - Thermodynamics Research Center, NIST Boulder Laboratories, Chris Muzny director

Quantity Value Units Method Reference Comment
Tboil381.2KN/AAldrich Chemical Company Inc., 1990BS
Tboil380.55KN/APomerantz, Fookson, et al., 1954Uncertainty assigned by TRC = 0.6 K; TRC
Tboil380.KN/ABuchman and Conly, 1953Uncertainty assigned by TRC = 3. K; TRC

In addition to the Thermodynamics Research Center (TRC) data available from this site, much more physical and chemical property data is available from the following TRC products:

References

Aldrich Chemical Company Inc., 1990
Aldrich Chemical Company Inc., Catalog Handbook of Fine Chemicals, Aldrich Chemical Company, Inc., Milwaukee WI, 1990, 1. [all data]

Pomerantz, Fookson, et al., 1954
Pomerantz, P.; Fookson, A.; Mears, T.W.; Rothberg, S.; Howard, F.L., Synth. and Phys. Prop. of Several Aliphatic and Alicyclic Hydrocarbons hydrocarbons, J. Res. Natl. Bur. Stand. (U. S.), 1954, 52, 59-65. [all data]

Buchman and Conly, 1953
Buchman, E.R.; Conly, J.C., The Reaction of Silver Cyclobutanecarboxylate with Bromine, J. Am. Chem. Soc., 1953, 75, 1990. [all data]