3H-1,4-Benzodiazepin-2-amine, 7-chloro-N-methyl-5-phenyl-

Kovats' RI, non-polar column, isothermal

Data compiled by: NIST Mass Spectrometry Data Center, William E. Wallace, director

Column type CapillaryPackedPackedPacked
Active phase SPB-1SE-30SE-30OV-1
Column length (m) 25. 1.5
Carrier gas HeN2N2
Substrate   Chromosorb G AW DMCS (80-100 mesh)
Column diameter (mm) 0.20
Phase thickness (μm)
Temperature (C) 250.250.250.250.
I 2520.2570.2570.2520.
ReferenceLora-Tamayo, Rams, et al., 1986Schütz, 1982Schuetz and Westenberger, 1979Berninger and Möller, 1977
Comment MSDC-RI MSDC-RI MSDC-RI MSDC-RI

Van Den Dool and Kratz RI, non-polar column, temperature ramp

Data compiled by: NIST Mass Spectrometry Data Center, William E. Wallace, director

Column type CapillaryPacked
Active phase SPB-1SE-30
Column length (m) 30.1.8
Carrier gas HeN2
Substrate  Chromosorb W
Column diameter (mm) 0.75
Phase thickness (μm) 1.0
Tstart (C) 160.130.
Tend (C) 280.290.
Heat rate (K/min) 10.8.
Initial hold (min)  2.
Final hold (min) 12.8.
I 2516.2500.
ReferenceChrist, Noomano, et al., 1988Perrigo and Peel, 1981
Comment MSDC-RI MSDC-RI

Normal alkane RI, non-polar column, temperature ramp

Data compiled by: NIST Mass Spectrometry Data Center, William E. Wallace, director

Column type Packed
Active phase SE-30
Column length (m) 2.
Carrier gas
Substrate Gas Chrom P
Column diameter (mm)
Phase thickness (μm)
Tstart (C) 150.
Tend (C) 300.
Heat rate (K/min) 5.
Initial hold (min)
Final hold (min)
I 2570.
ReferenceMarozzi, Gambaro, et al., 1982
Comment MSDC-RI

References

Lora-Tamayo, Rams, et al., 1986
Lora-Tamayo, C.; Rams, M.A.; Chacon, J.M.R., Gas Chromatographic Data for 187 Nitrogen- or Phosphorus-Containing Drugs and Metabolites of Toxicological Interest Analysed on Methyl Silicone Capillary Columns, J. Chromatogr., 1986, 374, 73-85, https://doi.org/10.1016/S0378-4347(00)83254-5 . [all data]

Schütz, 1982
Schütz, H., Benzodiazepines, Springer-Verlag, New York, 1982, 438. [all data]

Schuetz and Westenberger, 1979
Schuetz, H.; Westenberger, V., Gas chromatographic data of 31 benzodiazepines and metabolites, J. Chromatogr., 1979, 169, 409-411, https://doi.org/10.1016/0021-9673(75)85071-0 . [all data]

Berninger and Möller, 1977
Berninger, H.; Möller, M.R., Retentionsindices zur gaschromatographischen Identifizierung von Arzneimitteln, Arch. Toxicol., 1977, 37, 4, 295-305, https://doi.org/10.1007/BF00330821 . [all data]