Diazepam

Van Den Dool and Kratz RI, non-polar column, temperature ramp

Data compiled by: NIST Mass Spectrometry Data Center, William E. Wallace, director

Column type CapillaryCapillaryCapillaryCapillaryCapillary
Active phase VF-5MSSPB-1DB-1Methyl SiliconeDB-1
Column length (m) 30.30.15.12.15.
Carrier gas HeHeHeHeHe
Substrate
Column diameter (mm) 0.250.750.320.20.25
Phase thickness (μm) 0.251.00.250.330.25
Tstart (C) 60.160.120.50.120.
Tend (C) 270.280.280.300.280.
Heat rate (K/min)  10.8.20.8.
Initial hold (min)    1.
Final hold (min)  12.5.3.5.
I 2525.82460.2404.2407.02404.
ReferenceTretyakov, 2014Christ, Noomano, et al., 1988Perrigo, Peel, et al., 1985Newton and Foery, 1984Perrigo, Ballantyne, et al., 1984
Comment MSDC-RI MSDC-RI MSDC-RI MSDC-RI MSDC-RI
Column type Packed
Active phase SE-30
Column length (m) 1.8
Carrier gas N2
Substrate Chromosorb W
Column diameter (mm)
Phase thickness (μm)
Tstart (C) 130.
Tend (C) 290.
Heat rate (K/min) 8.
Initial hold (min) 2.
Final hold (min) 8.
I 2405.
ReferencePerrigo and Peel, 1981
Comment MSDC-RI

Kovats' RI, non-polar column, custom temperature program

Data compiled by: NIST Mass Spectrometry Data Center, William E. Wallace, director

Column type PackedPackedPackedPacked
Active phase OV-101OV-1OV-1SE-30
Column length (m) 2.2.2.2.
Carrier gas N2N2N2
Substrate Chromosorb WChromosorb G, AW-DMCSChromosorb G, AW-DMCS
Column diameter (mm)
Phase thickness (μm)
Program not specifiednot specifiednot specifiednot specified
I 2440.2480.2485.2407.
ReferenceMcLinden and Stenhouse, 1979Berninger, Grunnagel, et al., 1975Berninger, Grunnagel, et al., 1975Moffat, Stead, et al., 1974
Comment MSDC-RI MSDC-RI MSDC-RI MSDC-RI

Phase change data

Data compiled by: William E. Acree, Jr., James S. Chickos

Enthalpy of fusion

ΔfusH (kcal/mol) Temperature (K) Method Reference
5.90404.8DSCWassvik, Holmén, et al., 2006
6.092403.6DSCVerheyen, Augustijns, et al., 2001

References

Tretyakov, 2014
Tretyakov, K.V., Retention Data. NIST Mass Spectrometry Data Center., NIST Mass Spectrometry Data Center, 2014. [all data]

Christ, Noomano, et al., 1988
Christ, D.W.; Noomano, P.; Rosas, M.; Rhone, D., Retention indices by wide-bore capillary gas chromatography with nitrogen-phosphorus detection, J. Anal. Toxicol., 1988, 12, 2, 84-88, https://doi.org/10.1093/jat/12.2.84 . [all data]

Perrigo, Peel, et al., 1985
Perrigo, B.J.; Peel, H.W.; Ballantyne, D.J., Use of Dual-Column Fused-Silica Capillary Gas Chromatography in Combination with Detector Response Factors for Analytical Toxicology., J. Chromatogr., 1985, 341, 81-88, https://doi.org/10.1016/S0378-4347(00)84011-6 . [all data]

Newton and Foery, 1984
Newton, B.; Foery, R.F., Retention indices and dual capillary gas chromatography for rapid identification of sedative hypnotic drugs in emergency toxicology, J. Anal. Toxicol., 1984, 8, 3, 129-134, https://doi.org/10.1093/jat/8.3.129 . [all data]

Perrigo, Ballantyne, et al., 1984
Perrigo, B.J.; Ballantyne, D.J.; Peel, H.W., Condierations in developing a data base for drugs on a DBI capillary column, J. Can. Soc. Forensic Sci., 1984, 17, 2, 41-49, https://doi.org/10.1080/00085030.1984.10757360 . [all data]

Perrigo and Peel, 1981
Perrigo, B.J.; Peel, H.W., The use of retention indices and temperature-programmed gas chromatography in analytical toxicology, J. Chromatogr. Sci., 1981, 19, 5, 219-226, https://doi.org/10.1093/chromsci/19.5.219 . [all data]