HBr3Sn

Reaction thermochemistry data

Data compiled by: John E. Bartmess

Individual Reactions

Br3Sn- + Hydrogen cation = HBr3Sn

By formula: Br3Sn- + H+ = HBr3Sn

Quantity Value Units Method Reference Comment
Δr288.50kcal/molN/ACheck, Faust, et al., 2001gas phase; Ni-; ; ΔS(EA)=5.8
Quantity Value Units Method Reference Comment
Δr279.90kcal/molN/ACheck, Faust, et al., 2001gas phase; Ni-; ; ΔS(EA)=5.8

Gas phase ion energetics data

Data compiled by: John E. Bartmess

De-protonation reactions

Br3Sn- + Hydrogen cation = HBr3Sn

By formula: Br3Sn- + H+ = HBr3Sn

Quantity Value Units Method Reference Comment
Δr288.50kcal/molN/ACheck, Faust, et al., 2001gas phase; Ni-; ; ΔS(EA)=5.8
Quantity Value Units Method Reference Comment
Δr279.90kcal/molN/ACheck, Faust, et al., 2001gas phase; Ni-; ; ΔS(EA)=5.8

References

Check, Faust, et al., 2001
Check, C.E.; Faust, T.O.; Bailey, J.M.; Wright, B.J.; Gilbert, T.M.; Sunderlin, L.S., Addition of Polarization and Diffuse Functions to the LANL2DZ Basis Set for P-Block Elements, J. Phys. Chem. A,, 2001, 105, 34, 8111, https://doi.org/10.1021/jp011945l . [all data]