1,3-Dioxolane, 2,2-diethyl-
- Formula: C7H14O2
- Molecular weight: 130.1849
- IUPAC Standard InChIKey: VEMJEYFBPWSPHU-UHFFFAOYSA-N
- CAS Registry Number: 4362-57-6
- Chemical structure:

Normal alkane RI, polar column, temperature ramp

Column type | Active phase | I | Reference | Comment |
---|---|---|---|---|
Capillary | DB-Wax | 1208. | Souza, Re-Poppi, et al., 2012 | 30. m/0.25 mm/0.25 μm, Helium, 60. C @ 1. min, 5. K/min; Tend: 240. C |

References

Souza, Re-Poppi, et al., 2012
Souza, J.B.G.; Re-Poppi, N.; Raposo, J.L.(Jr).,
Characterization of pyroligneous acid used in agriculture by gas chromatography - mass spectrometry (in press),
J. Braz. Chem. Soc., 2012, 00, 00, 1-8. [all data]