cis-4-Hydroxycyclohexanecarboxylic acid lactone

Phase change data

Data compiled as indicated in comments:
ALS - Hussein Y. Afeefy, Joel F. Liebman, and Stephen E. Stein
DRB - Donald R. Burgess, Jr.

Quantity Value Units Method Reference Comment
Δsub69.6 ± 2.1kJ/molCAndruzzi, Pilcher, et al., 1980Hf(l)=-452.6±1.8 kJ/mol; ALS
Δsub69.6kJ/molN/AAndruzzi, Pilcher, et al., 1980DRB

Condensed phase thermochemistry data

Data compiled by: Hussein Y. Afeefy, Joel F. Liebman, and Stephen E. Stein

Quantity Value Units Method Reference Comment
Δfsolid-111.4 ± 0.38kcal/molCcbAndruzzi, Pilcher, et al., 1980Hf(l)=-452.6±1.8 kJ/mol
Quantity Value Units Method Reference Comment
Δcsolid-888.50 ± 0.31kcal/molCcbAndruzzi, Pilcher, et al., 1980Hf(l)=-452.6±1.8 kJ/mol; Corresponding Δfsolid = -111.4 kcal/mol (simple calculation by NIST; no Washburn corrections)

References

Andruzzi, Pilcher, et al., 1980
Andruzzi, F.; Pilcher, G.; Hacking, J.M.; Cavell, S., Enthalpy of polymerisation of 2-oxabicyclo[2.2.2]octan-3-one, Makromol. Chem., 1980, 181, 923-929. [all data]