5,6-Dichloro-2-(4-n-tridecafluorohexylphenyl)isoindole-1,3-dione

Phase change data

Data compiled by: William E. Acree, Jr., James S. Chickos

Enthalpy of fusion

ΔfusH (kJ/mol) Temperature (K) Reference
40.7459.6Jow and Dingemans, 2002

References

Jow and Dingemans, 2002
Jow, Kenny G.; Dingemans, Theo J., Liquid crystals derived from 2-phenylisoindoles: synthesis and characterization, Liquid Crystals, 2002, 29, 4, 573-581, https://doi.org/10.1080/02678290110116213 . [all data]