2-Cyclohexene-1-carboxaldehyde, 2,6,6-trimethyl-

Normal alkane RI, non-polar column, temperature ramp

Data compiled by: NIST Mass Spectrometry Data Center, William E. Wallace, director

Column type CapillaryCapillaryCapillaryCapillary
Active phase HP-5MSDB-5SPB-SulfurSPB-Sulfur
Column length (m) 30.30.30.30.
Carrier gas HeHydrogenHeHe
Substrate
Column diameter (mm) 0.250.250.320.32
Phase thickness (μm) 0.250.254.4.
Tstart (C) 60.70.45.45.
Tend (C) 250.280.240.240.
Heat rate (K/min) 2.4.5.5.
Initial hold (min) 8.4.13.13.
Final hold (min) 15. 5.5.
I 1102.1116.1124.1124.
ReferenceFerhat, Tigrine-Kordjani, et al., 2007Pino, Marbot, et al., 2006Mariaca, Berger, et al., 1997Mariaca, Berger, et al., 1997
Comment MSDC-RI MSDC-RI MSDC-RI MSDC-RI

Van Den Dool and Kratz RI, non-polar column, temperature ramp

View large format table.

Column type Active phase I Reference Comment
CapillaryDB-Petro1096.3Pang T., Zhu S., et al., 200750. m/0.2 mm/0.5 μm, 2. K/min; Tstart: 50. C; Tend: 270. C
CapillaryDB-Petro1097.5Pang T., Zhu S., et al., 200750. m/0.2 mm/0.5 μm, 2. K/min; Tstart: 50. C; Tend: 270. C
CapillaryHP-5MS1122.9Zhao C.X., Li, et al., 200630. m/0.25 mm/0.25 μm, He, 4. K/min; Tstart: 80. C; Tend: 300. C

Van Den Dool and Kratz RI, polar column, temperature ramp

View large format table.

Column type Active phase I Reference Comment
CapillaryZB-Wax1420.Ledauphin, Basset, et al., 200630. m/0.25 mm/0.15 μm, He, 35. C @ 5. min, 5. K/min, 220. C @ 10. min
CapillaryDB-Wax1430.Shimoda, Shigematsu, et al., 199560. m/0.25 mm/0.25 μm, 2. K/min; Tstart: 50. C; Tend: 230. C

Normal alkane RI, non-polar column, custom temperature program

View large format table.

Column type Active phase I Reference Comment
CapillaryTR-5 MS1105.Kurashov, Mitrukova, et al., 201415. m/0.25 mm/0.25 μm, Helium; Program: 35 0C (3 min) 2 0C/min -> 60 0C (3 min) 2 0C/min -> 80 0C (3 min) 4 0C/min -> 120 0C (3 min) 5 0C/min -> 150 0C (3 min) 15 0C/min -> 240 0C (10 min)
CapillaryPolydimethyl siloxane with 5 % Ph groups1116.Robinson, Adams, et al., 2012Program: not specified
CapillaryPolydimethyl siloxane with 5 % Ph groups1127.Robinson, Adams, et al., 2012Program: not specified
CapillaryPolydimethyl siloxanes1100.Zenkevich, 1997Program: not specified
CapillaryDB-11095.Buttery, Teranishi, et al., 1990Column length: 60. m; Column diameter: 0.32 mm; Program: not specified
PackedOV-1011100.Swigar and Silverstein, 1981N2, Chromosorb G 60-80mesh DMCS; Column length: 2.5 m; Program: not specified

References

Ferhat, Tigrine-Kordjani, et al., 2007
Ferhat, M.A.; Tigrine-Kordjani, N.; Chemat, S.; Meklati, B.Y.; Chemat, F., Rapid Extraction of Volatile Compounds Using a New Simultaneous Microwave Distillation: Solvent Extraction Device, Chromatographia, 2007, 65, 3-4, 217-222, https://doi.org/10.1365/s10337-006-0130-5 . [all data]

Pino, Marbot, et al., 2006
Pino, J.A.; Marbot, R.; Payo, A.; Chao, D.; Herrera, P., Aromatic Plants from Western Cuba VII. Composition of the Leaf Oil of Psidium wrightii KRug et Urb., Lantana involucrata L., Cinnamonum montanum (Sw.) Berchtold et J. Persl. and Caesalpinia violacea (Mill.) Standley, J. Essent. Oil. Res., 2006, 18, 2, 170-174, https://doi.org/10.1080/10412905.2006.9699058 . [all data]

Mariaca, Berger, et al., 1997
Mariaca, R.G.; Berger, T.F.H.; Gauch, R.; Imhof, M.I.; Jeangros, B.; Bosset, J.O., Occurrence of volatile mono- and sesquiterpenoids in highland and lowland plant species as possible precursors for flavor compounds in milk and dairy products, J. Agric. Food Chem., 1997, 45, 11, 4423-4434, https://doi.org/10.1021/jf970216t . [all data]