Arsine, methylbis(trifluoromethyl)-

Gas phase ion energetics data

Data compiled as indicated in comments:
LBLHLM - Sharon G. Lias, John E. Bartmess, Joel F. Liebman, John L. Holmes, Rhoda D. Levin, and W. Gary Mallard
RDSH - Henry M. Rosenstock, Keith Draxl, Bruce W. Steiner, and John T. Herron

Ionization energy determinations

IE (eV) Method Reference Comment
10.0PEGleiter, Goodmann, et al., 1983LBLHLM
10.5 ± 0.1EICullen and Frost, 1962RDSH
10.7PEGleiter, Goodmann, et al., 1983Vertical value; LBLHLM

References

Gleiter, Goodmann, et al., 1983
Gleiter, R.; Goodmann, W.D.; Schafer, W.; Grobe, J.; Apel, J., He(I)-PE spektren der verbindungen (CH3)nE(CF3)3-n fur E = P, us, Sb und n = 0 - 3, Chem. Ber., 1983, 116, 3745. [all data]

Cullen and Frost, 1962
Cullen, W.R.; Frost, D.C., Ionization potentials of some perfluoroalkyl arsines, Can. J. Chem., 1962, 40, 390. [all data]