(E,Z)-2,4-Heptadienal

Normal alkane RI, non-polar column, custom temperature program

Data compiled by: NIST Mass Spectrometry Data Center, William E. Wallace, director

Column type CapillaryCapillary
Active phase HP-5 MSHP-5 MS
Column length (m) 30.30.
Carrier gas HeliumHelium
Substrate
Column diameter (mm) 0.250.25
Phase thickness (μm) 0.250.25
Program 40 0C (2 min) 4 0C/min -> 220 0C 20 0C/min -> 280 0C40 0C (2 min) 4 0C/min -> 220 0C 20 0C/min -> 280 0C
I 998.998.
ReferenceXie, Sun, et al., 2008Xie, Sun, et al., 2008
Comment MSDC-RI MSDC-RI

Kovats' RI, polar column, temperature ramp

Data compiled by: NIST Mass Spectrometry Data Center, William E. Wallace, director

Column type CapillaryCapillary
Active phase Carbowax 20MCarbowax 20M
Column length (m) 70.70.
Carrier gas N2N2
Substrate
Column diameter (mm) 0.280.28
Phase thickness (μm)
Tstart (C) 80.80.
Tend (C) 200.200.
Heat rate (K/min) 2.2.
Initial hold (min)
Final hold (min)
I 1430.1435.
ReferenceYamaguchi and Shibamoto, 1981Yamaguchi and Shibamoto, 1981
Comment MSDC-RI MSDC-RI

References

Xie, Sun, et al., 2008
Xie, J.; Sun, B.; Zheng, F.; Wang, S., Volatile flavor constituents in roasted pork of mini-pig, Food Chem., 2008, 109, 3, 506-514, https://doi.org/10.1016/j.foodchem.2007.12.074 . [all data]