1,3,9,11-Tetraoxacyclohexadecane

Phase change data

Data compiled as indicated in comments:
TRC - Thermodynamics Research Center, NIST Boulder Laboratories, Chris Muzny director
AC - William E. Acree, Jr., James S. Chickos

Quantity Value Units Method Reference Comment
Tfus330.KN/ADale and Ekeland, 1973Uncertainty assigned by TRC = 1. K; TRC

Enthalpy of fusion

ΔfusH (kcal/mol) Temperature (K) Reference Comment
8.499332.Dale, Ekeland, et al., 1973AC

In addition to the Thermodynamics Research Center (TRC) data available from this site, much more physical and chemical property data is available from the following TRC products:

References

Dale and Ekeland, 1973
Dale, J.; Ekeland, T., Eight-ring Monomeric and Sixteen-ring Dimeric Formals and Ketals., Acta Chem. Scand., 1973, 27, 1519, https://doi.org/10.3891/acta.chem.scand.27-1519 . [all data]

Dale, Ekeland, et al., 1973
Dale, Johannes; Ekeland, Terje; Nilsson, J. Lars G.; Swahn, Carl-Gunnar; van der Hoeven, Marcel G.; Swahn, Carl-Gunnar, Eight-ring Monomeric and Sixteen-ring Dimeric Formals and Ketals., Acta Chem. Scand., 1973, 27, 1519-1525, https://doi.org/10.3891/acta.chem.scand.27-1519 . [all data]