Ethylamine, 2,2-difluoro-

Condensed phase thermochemistry data

Data compiled by: Hussein Y. Afeefy, Joel F. Liebman, and Stephen E. Stein

Quantity Value Units Method Reference Comment
Δfliquid-118.96kcal/molCcbSwarts, 1909
Quantity Value Units Method Reference Comment
Δcliquid-326.15kcal/molCcbSwarts, 1919Not corrected for CODATA value of ΔfH
Δcliquid-324.28kcal/molCcbSwarts, 1909

Gas phase ion energetics data

Data evaluated as indicated in comments:
HL - Edward P. Hunter and Sharon G. Lias

Data compiled as indicated in comments:
LLK - Sharon G. Lias, Rhoda D. Levin, and Sherif A. Kafafi

Quantity Value Units Method Reference Comment
Proton affinity (review)208.1kcal/molN/AHunter and Lias, 1998HL
Quantity Value Units Method Reference Comment
Gas basicity200.0kcal/molN/AHunter and Lias, 1998HL

Ionization energy determinations

IE (eV) Method Reference Comment
9.4PEAue and Bowers, 1979LLK

References

Swarts, 1909
Swarts, M.F., Sur la chaleur de formation de quelquesuns compounds organiques fluords, Recl. Trav. Chim. Pays-Bas, 1909, 28, 143-154. [all data]

Swarts, 1919
Swarts, F., Etudes thermochimiques sur les combinaisons organiques fluorees, J. Chim. Phys., 1919, 17, 3-70. [all data]

Hunter and Lias, 1998
Hunter, E.P.; Lias, S.G., Evaluated Gas Phase Basicities and Proton Affinities of Molecules: An Update, J. Phys. Chem. Ref. Data, 1998, 27, 3, 413-656, https://doi.org/10.1063/1.556018 . [all data]

Aue and Bowers, 1979
Aue, D.H.; Bowers, M.T., Chapter 9. Stabilities of positive ions from equilibrium gas phase basicity measurements in Ions Chemistry,, ed. M.T. Bowers, 1979. [all data]