3-methyl-1,2,4-trithiane

Van Den Dool and Kratz RI, non-polar column, temperature ramp

Data compiled by: NIST Mass Spectrometry Data Center, William E. Wallace, director

Column type CapillaryCapillaryCapillaryCapillaryCapillary
Active phase BPX-5BPX-5BP-5DB-5DB-1
Column length (m) 50.50.50.30.60.
Carrier gas  He  He
Substrate
Column diameter (mm) 0.320.320.320.320.25
Phase thickness (μm) 0.50.5 1.0.25
Tstart (C) 60.60.60.60.40.
Tend (C) 250.250.250.250.220.
Heat rate (K/min) 4.4.4.4.2.
Initial hold (min) 5.5. 5.
Final hold (min) 20.10. 20.10.
I 1290.1287.1254.1253.1214.
ReferenceBredie, Mottram, et al., 2002Ames, Guy, et al., 2001Whitfield and Mottram, 2001Madruga and Mottram, 1998Zhang and Ho, 1989
Comment MSDC-RI MSDC-RI MSDC-RI MSDC-RI MSDC-RI

References

Bredie, Mottram, et al., 2002
Bredie, W.L.P.; Mottram, D.S.; Guy, R.C.E., Effect of temperature and pH on the generation of flavor volatiles in extrusion cooking of wheat flour, J. Agric. Food Chem., 2002, 50, 5, 1118-1125, https://doi.org/10.1021/jf0111662 . [all data]

Ames, Guy, et al., 2001
Ames, J.M.; Guy, R.C.E.; Kipping, G.J., Effect of pH and temperature on the formation of volatile compounds in cysteine/reducing sugar/starch mixtures during extrusion cooking, J. Agric. Food Chem., 2001, 49, 4, 1885-1894, https://doi.org/10.1021/jf0012547 . [all data]

Whitfield and Mottram, 2001
Whitfield, F.B.; Mottram, D.S., Heterocyclic volatiles formed by heating cysteine or hydrogen sulfide with 4-hydroxy-5-methyl-3(2H)-furanone at pH 6.5, J. Agric. Food Chem., 2001, 49, 2, 816-822, https://doi.org/10.1021/jf0008644 . [all data]

Madruga and Mottram, 1998
Madruga, M.S.; Mottram, D.S., The effect of pH on the formation of volatile compounds produced by heating a model system containing 5'-imp and cysteine, J. Braz. Chem. Soc., 1998, 9, 3, 261-271, https://doi.org/10.1590/S0103-50531998000300010 . [all data]

Zhang and Ho, 1989
Zhang, Y.; Ho, C.-T., Volatile compounds formed from thermnal interaction of 2,4-decadienal with cysteine and glutathione, J. Agric. Food Chem., 1989, 37, 4, 1016-1020, https://doi.org/10.1021/jf00088a044 . [all data]