2-Propionyl thiazole

Normal alkane RI, polar column, custom temperature program

Data compiled by: NIST Mass Spectrometry Data Center, William E. Wallace, director

Column type Capillary
Active phase FFAP
Column length (m) 25.
Carrier gas He
Substrate
Column diameter (mm) 0.32
Phase thickness (μm) 0.25
Program 35C(2min) => 40C/min => 60C(2min) => 6C/min => 230C
I 1702.
ReferenceZehentbauer and Grosch, 1998
Comment MSDC-RI

References

Zehentbauer and Grosch, 1998
Zehentbauer, G.; Grosch, W., Crust aroma of baguettes. I. Key odorants of baguettes prepared in two different ways, J. Cereal Science, 1998, 28, 1, 81-92, https://doi.org/10.1006/jcrs.1998.0184 . [all data]