Disulfide, (1-methylethyl) (1,1-dimethylethyl)

Gas phase thermochemistry data

Data compiled by: Hussein Y. Afeefy, Joel F. Liebman, and Stephen E. Stein

Quantity Value Units Method Reference Comment
Δfgas-167.kJ/molIonHawari, Griller, et al., 1986

Gas phase ion energetics data

Data compiled by: Sharon G. Lias, John E. Bartmess, Joel F. Liebman, John L. Holmes, Rhoda D. Levin, and W. Gary Mallard

Ionization energy determinations

IE (eV) Method Reference
8.1 ± 0.8EIHawari, Griller, et al., 1986, 2

Appearance energy determinations

Ion AE (eV) Other Products MethodReferenceComment
C3H7S2+9.1 ± 0.8(CH3)3CEIHawari, Griller, et al., 1986, 2

Kovats' RI, non-polar column, isothermal

View large format table.

Column type Active phase Temperature (C) I Reference Comment
PackedApiezon M130.1060.Garbuzov, Misharina, et al., 1985He or N2, Chromosorb W, AW-DMCS; Column length: 2.1 m

Normal alkane RI, non-polar column, custom temperature program

View large format table.

Column type Active phase I Reference Comment
CapillaryApieson M1060.Gao, Wang, et al., 2003Program: not specified

Normal alkane RI, polar column, custom temperature program

View large format table.

Column type Active phase I Reference Comment
CapillaryPEG-10001308.Gao, Wang, et al., 2003Program: not specified

References

Hawari, Griller, et al., 1986
Hawari, J.A.; Griller, D.; Lossing, F.P., Thermochemistry of perthiyl radicals, J. Am. Chem. Soc., 1986, 108, 3273-3275. [all data]

Hawari, Griller, et al., 1986, 2
Hawari, J.A.; Griller, D.; Lossing, F.P., Thermochemistry of perthiyl radicals, J. Am. Chem. Soc., 1986, 108, 3273. [all data]

Garbuzov, Misharina, et al., 1985
Garbuzov, V.G.; Misharina, T.A.; Aerov, A.F.; Golovnya, R.V., Gas chromatographic retention indices for sulphur(II)-containing organic substances, J. Anal. Chem. USSR (Engl. Transl.), 1985, 40, 4, 576-586. [all data]

Gao, Wang, et al., 2003
Gao, Y.; Wang, Y.; Yao, X.; Zhang, X.; Liu, M.; Hu, Z.; Fan, B., The prediction for gas chromatographic retention index of disulfides on stationary phases of different polarity, Talanta, 2003, 59, 2, 229-237, https://doi.org/10.1016/S0039-9140(02)00500-3 . [all data]