Ethane, 1-iodo-2-methoxy-

Gas phase ion energetics data

Data compiled by: Sharon G. Lias, Rhoda D. Levin, and Sherif A. Kafafi

Ionization energy determinations

IE (eV) Method Reference Comment
9.43 ± 0.04PELeavell, Steichen, et al., 1973Vertical value

References

Leavell, Steichen, et al., 1973
Leavell, S.; Steichen, J.; Franklin, J.L., Photoelectron spectra of intramolecularly hydrogen bonded compounds, J. Chem. Phys., 1973, 59, 4343. [all data]