Cyclohexane, pentyl-

Kovats' RI, non-polar column, temperature ramp

Data compiled by: NIST Mass Spectrometry Data Center, William E. Wallace, director

Column type CapillaryCapillaryCapillaryCapillary
Active phase SE-54OV-101OV-101Apiezon L
Column length (m) 30.50.50.50.
Carrier gas He  N2
Substrate
Column diameter (mm) 0.250.230.230.25
Phase thickness (μm) 0.25
Tstart (C) 0.80.80.60.
Tend (C) 250.200.200.
Heat rate (K/min) 12.2.2.1.
Initial hold (min) 12.
Final hold (min)
I 1128.1130.1134.1155.
ReferenceRembold, Wallner, et al., 1989Ohnishi and Shibamoto, 1984Ohnishi and Shibamoto, 1984Louis, 1971
Comment MSDC-RI MSDC-RI MSDC-RI MSDC-RI

Condensed phase thermochemistry data

Data compiled by: Hussein Y. Afeefy, Joel F. Liebman, and Stephen E. Stein

Quantity Value Units Method Reference Comment
Δcliquid-7239.1 ± 1.5kJ/molCcbProsen, Johnson, et al., 1946Corresponding Δfliquid = -233.7 kJ/mol (simple calculation by NIST; no Washburn corrections)

References

Rembold, Wallner, et al., 1989
Rembold, H.; Wallner, P.; Nitz, S.; Kollmannsberger, H.; Drawert, F., Volatile components of chickpea (Cicer arietinum L.) seed, J. Agric. Food Chem., 1989, 37, 3, 659-662, https://doi.org/10.1021/jf00087a018 . [all data]

Ohnishi and Shibamoto, 1984
Ohnishi, S.; Shibamoto, T., Volatile compounds from heated beef fat and beef fat with glycine, J. Agric. Food Chem., 1984, 32, 5, 987-992, https://doi.org/10.1021/jf00125a008 . [all data]

Louis, 1971
Louis, R., Kovats-index-tafeln zur gaschromatographischen analyse von kohlenwasserstoffgemischen, Erdoel Kohle Erdgas Petrochem., 1971, 24, 2, 88-94. [all data]