1-Tert-butoxy-3-ethoxy-2-propanol

Condensed phase thermochemistry data

Data compiled by: Hussein Y. Afeefy, Joel F. Liebman, and Stephen E. Stein

Quantity Value Units Method Reference Comment
Δfliquid-751. ± 3.kJ/molCcbZaikin, Van-Chin-Syan, et al., 1974
Quantity Value Units Method Reference Comment
Δcliquid-5649. ± 3.kJ/molCcbZaikin, Van-Chin-Syan, et al., 1974Corresponding Δfliquid = -750.6 kJ/mol (simple calculation by NIST; no Washburn corrections)

References

Zaikin, Van-Chin-Syan, et al., 1974
Zaikin, I.D.; Van-Chin-Syan, Y.Y.; Chuchmarev, S.K.; Elagin, G.I., Standard heats of formation of certain 1-alkoxy-3-t-butoxy-2-propanols, Russ. J. Phys. Chem. (Engl. Transl.), 1974, 48, 1105-1106. [all data]