1-Iodoundecane

Phase change data

Data compiled as indicated in comments:
BS - Robert L. Brown and Stephen E. Stein
AC - William E. Acree, Jr., James S. Chickos

Quantity Value Units Method Reference Comment
Δvap74.8kJ/molA,EStephenson and Malanowski, 1987Based on data from 412. - 618. K. See also Li and Rossini, 1961, Dykyj and Vanko, 1970, and Bolotnikov and Neruchev, 2006.; AC

Reduced pressure boiling point

Tboil (K) Pressure (bar) Reference Comment
400.70.007Aldrich Chemical Company Inc., 1990BS

Enthalpy of vaporization

ΔvapH (kJ/mol) Temperature (K) Method Reference Comment
60.1437.N/ADykyj, Svoboda, et al., 1999Based on data from 422. - 589. K.; AC
60.9427.A,EStephenson and Malanowski, 1987Based on data from 412. - 618. K. See also Li and Rossini, 1961 and Dykyj and Vanko, 1970.; AC

Van Den Dool and Kratz RI, non-polar column, custom temperature program

View large format table.

Column type Active phase I Reference Comment
CapillaryDB-11537.Peng, 200015. m/0.53 mm/1. μm, He; Program: 40C(3min) => 8C/min => 200(1min) => 5C/min => 300C(25min)

Van Den Dool and Kratz RI, polar column, temperature ramp

View large format table.

Column type Active phase I Reference Comment
CapillaryDB-Wax1816.Peng, 200015. m/0.53 mm/1. μm, He, 40. C @ 3. min, 5. K/min, 220. C @ 30. min
CapillaryHP-Wax1813.Peng, 200015. m/0.53 mm/1. μm, He, 40. C @ 3. min, 5. K/min, 220. C @ 30. min

Normal alkane RI, non-polar column, isothermal

View large format table.

Column type Active phase Temperature (C) I Reference Comment
CapillaryApiezon L130.1534.Arruda, Junkes, et al., 2008

Normal alkane RI, polar column, custom temperature program

View large format table.

Column type Active phase I Reference Comment
CapillaryDB-Wax1842.Peng, Yang, et al., 1991Program: not specified

References

Stephenson and Malanowski, 1987
Stephenson, Richard M.; Malanowski, Stanislaw, Handbook of the Thermodynamics of Organic Compounds, 1987, https://doi.org/10.1007/978-94-009-3173-2 . [all data]

Li and Rossini, 1961
Li, J.C.M.; Rossini, F.D., Vapor Pressures and Boiling Points of the l-Fluoroalkanes, l-Chloroalkanes, l-Bromoalkanes, and l-Iodoalkanes, C 1 to C 20 ., J. Chem. Eng. Data, 1961, 6, 2, 268-270, https://doi.org/10.1021/je60010a025 . [all data]

Dykyj and Vanko, 1970
Dykyj, J.; Vanko, A., Petrochemica, 1970, 10, 1, 3. [all data]

Bolotnikov and Neruchev, 2006
Bolotnikov, Mikhail F.; Neruchev, Yurij A., Enthalpies of vaporization of a series of the 1-iodoalkanes, Fluid Phase Equilibria, 2006, 243, 1-2, 121-125, https://doi.org/10.1016/j.fluid.2006.02.006 . [all data]

Aldrich Chemical Company Inc., 1990
Aldrich Chemical Company Inc., Catalog Handbook of Fine Chemicals, Aldrich Chemical Company, Inc., Milwaukee WI, 1990, 1. [all data]

Dykyj, Svoboda, et al., 1999
Dykyj, J.; Svoboda, J.; Wilhoit, R.C.; Frenkel, M.L.; Hall, K.R., Vapor Pressure of Chemicals: Part A. Vapor Pressure and Antoine Constants for Hydrocarbons and Sulfur, Selenium, Tellurium and Hydrogen Containing Organic Compounds, Springer, Berlin, 1999, 373. [all data]

Peng, 2000
Peng, C.T., Prediction of retention indices. V. Influence of electronic effects and column polarity on retention index, J. Chromatogr. A, 2000, 903, 1-2, 117-143, https://doi.org/10.1016/S0021-9673(00)00901-8 . [all data]

Arruda, Junkes, et al., 2008
Arruda, A.C.S.; Junkes, B. da.S.; Souza, E.S.; Yunes, R.A.; Heizen, V.E.F., Semi-Emlirical Topological Index to Predict Properties of Halogenated Aliphatic Compounds, J. Chemometrics, 2008, 22, 3-4, 186-194, https://doi.org/10.1002/cem.1121 . [all data]

Peng, Yang, et al., 1991
Peng, C.T.; Yang, Z.C.; Ding, S.F., Prediction of rentention idexes. II. Structure-retention index relationship on polar columns, J. Chromatogr., 1991, 586, 1, 85-112, https://doi.org/10.1016/0021-9673(91)80028-F . [all data]