cis-1-methyl-3-propylcyclohexane

Phase change data

Data compiled by: Thermodynamics Research Center, NIST Boulder Laboratories, Chris Muzny director

Quantity Value Units Method Reference Comment
Tboil441.7KN/AMousseron and Paulet, 1939Uncertainty assigned by TRC = 2. K
Tboil441.9KN/AMousseron and Granger, 1938Uncertainty assigned by TRC = 2. K; cis-trans ismomers not definitely identified

In addition to the Thermodynamics Research Center (TRC) data available from this site, much more physical and chemical property data is available from the following TRC products:

References

Mousseron and Paulet, 1939
Mousseron, M.; Paulet, M., Parfum. Mod., 1939, 33, 101. [all data]

Mousseron and Granger, 1938
Mousseron, M.; Granger, R., Bull. Soc. Chim. Belg., 1938, 1938, 5 1618. [all data]