Benzoic acid,2-[[(4-methylphenyl)thio]carbonyl]-methyl ester

Gas phase ion energetics data

Data compiled by: Sharon G. Lias, Rhoda D. Levin, and Sherif A. Kafafi

Appearance energy determinations

Ion AE (eV) Other Products MethodReferenceComment
C9H7O3+11.0 ± 0.2?EISchwarz, Praefcke, et al., 1973

References

Schwarz, Praefcke, et al., 1973
Schwarz, H.; Praefcke, K.; Martens, J., Organische schwefelverbindungen. III. Elektronenstossinduzierte untersuchungen von arylestern der monothi und dithiophthalsaure und der isomeren 3,3-substituierten phthalide, Tetrahedron, 1973, 29, 2877. [all data]