1,1-Dimethylcyclohexadecane

Phase change data

Data compiled as indicated in comments:
TRC - Thermodynamics Research Center, NIST Boulder Laboratories, Chris Muzny director
AC - William E. Acree, Jr., James S. Chickos

Quantity Value Units Method Reference Comment
Tfus290.2KN/ABjörnstad, Borgen, et al., 1975Crystal phase 1 phase; Uncertainty assigned by TRC = 0.5 K; TRC

Enthalpy of fusion

ΔfusH (kJ/mol) Temperature (K) Reference Comment
14.23290.2Björnstad, Borgen, et al., 1975, 2AC

In addition to the Thermodynamics Research Center (TRC) data available from this site, much more physical and chemical property data is available from the following TRC products:

References

Björnstad, Borgen, et al., 1975
Björnstad, S.L.; Borgen, G.; Dale, J.; Gaupset, G., Syntheses and Conformational Properties of gem-Dimethyl Substituted Cyclohexadecanes., Acta Chem. Scand., 1975, 29b, 320, https://doi.org/10.3891/acta.chem.scand.29b-0320 . [all data]

Björnstad, Borgen, et al., 1975, 2
Björnstad, Sigrid L.; Borgen, Gerd; Dale, Johannes; Gaupset, Gudmund; Schroll, G.; Altona, C., Syntheses and Conformational Properties of gem-Dimethyl Substituted Cyclohexadecanes., Acta Chem. Scand., 1975, 29b, 320-324, https://doi.org/10.3891/acta.chem.scand.29b-0320 . [all data]