1,2,3,4-Tetramethylcyclopentadiene

Gas phase ion energetics data

Data compiled as indicated in comments:
LL - Sharon G. Lias and Joel F. Liebman
RDSH - Henry M. Rosenstock, Keith Draxl, Bruce W. Steiner, and John T. Herron

Ionization energy determinations

IE (eV) Method Reference Comment
7.30PEKiselev, Sakhabutdinov, et al., 1992LL
7.8 ± 0.1EIMeyer and Harrison, 1964RDSH
7.52PEKiselev, Sakhabutdinov, et al., 1992Vertical value; LL

References

Kiselev, Sakhabutdinov, et al., 1992
Kiselev, V.D.; Sakhabutdinov, A.G.; Shakirov, I.M.; Zverev, V.V.; Konovalov, A.I., Bis reactants in Diels-Alder reactions. VII. Preparation and properties of polyadducts of reactions of bis(polymethylcyclopentadienes) and bis(maleimides), Zh. Org. Khim., 1992, 28, 2244. [all data]

Meyer and Harrison, 1964
Meyer, F.; Harrison, A.G., Ionization potentials of methyl-substituted benzenes and cyclopentadienes, Can. J. Chem., 1964, 42, 2256. [all data]