p-Benzoquinone, 2,3,5,6-tetrafluoro- anion

Ion clustering data

Data compiled as indicated in comments:
B - John E. Bartmess
M - Michael M. Meot-Ner (Mautner) and Sharon G. Lias

Clustering reactions

C6F4O2- + Methyl Alcohol = (C6F4O2- • Methyl Alcohol)

By formula: C6F4O2- + CH4O = (C6F4O2- • CH4O)

Quantity Value Units Method Reference Comment
Δr13. ± 6.7kJ/molIMREChowdhury, Grimsrud, et al., 1987gas phase; Free energy affinity at 70°C.; B

Free energy of reaction

ΔrG° (kJ/mol) T (K) Method Reference Comment
13.343.PHPMSChowdhury, 1987gas phase; M

C6F4O2- + Acetonitrile = (C6F4O2- • Acetonitrile)

By formula: C6F4O2- + C2H3N = (C6F4O2- • C2H3N)

Quantity Value Units Method Reference Comment
Δr14. ± 6.7kJ/molIMREChowdhury, Grimsrud, et al., 1987gas phase; Free energy affinity at 70°C.; B

Free energy of reaction

ΔrG° (kJ/mol) T (K) Method Reference Comment
14.343.PHPMSChowdhury, 1987gas phase; M

C6F4O2- + Dimethyl Sulfoxide = (C6F4O2- • Dimethyl Sulfoxide)

By formula: C6F4O2- + C2H6OS = (C6F4O2- • C2H6OS)

Quantity Value Units Method Reference Comment
Δr19. ± 6.7kJ/molIMREChowdhury, Grimsrud, et al., 1987gas phase; Free energy affinity at 70°C.; B

Free energy of reaction

ΔrG° (kJ/mol) T (K) Method Reference Comment
19.343.PHPMSChowdhury, 1987gas phase; M

C6F4O2- + Formamide, N,N-dimethyl- = (C6F4O2- • Formamide, N,N-dimethyl-)

By formula: C6F4O2- + C3H7NO = (C6F4O2- • C3H7NO)

Quantity Value Units Method Reference Comment
Δr11. ± 6.7kJ/molIMREChowdhury, Grimsrud, et al., 1987gas phase; Free energy affinity at 70°C.; B

Free energy of reaction

ΔrG° (kJ/mol) T (K) Method Reference Comment
11.343.PHPMSChowdhury, 1987gas phase; M

References

Chowdhury, Grimsrud, et al., 1987
Chowdhury, S.; Grimsrud, E.P.; Kebarle, P., Bonding of Charged Delocalized Anions to Protic and Dipolar Aprotic Solvent Molecules, J. Phys. Chem., 1987, 91, 10, 2551, https://doi.org/10.1021/j100294a021 . [all data]

Chowdhury, 1987
Chowdhury, S. Grimsrud, Bonding of Charge Delocalized Anions to Protic and Dipolar Aprotic Solvents, J. Phys. Chem., 1987, 91, 10, 2551, https://doi.org/10.1021/j100294a021 . [all data]