10H-Phenothiastannin,10,10-dimethyl-

Gas phase ion energetics data

Data compiled by: Sharon G. Lias, Rhoda D. Levin, and Sherif A. Kafafi

Ionization energy determinations

IE (eV) Method Reference
8.0 ± 0.1EIInnorta, Torroni, et al., 1977
8.1EITerlouw, Heerma, et al., 1974

Appearance energy determinations

Ion AE (eV) Other Products MethodReferenceComment
C13H11SSn+8.9 ± 0.1CH3EIInnorta, Torroni, et al., 1977
C13H11SSn+9.4CH3EITerlouw, Heerma, et al., 1974

References

Innorta, Torroni, et al., 1977
Innorta, G.; Torroni, S.; Distefano, G.; Pietropaolo, D.; Ricci, A., Mass spectra and energetic data for the formation of the [M-CH3]+ ion of 10,10-dimethylphenylthio-silyn, -germyn and -stannyn derivatives and of 9,9-dimethylthioxantene, Org. Mass Spectrom., 1977, 12, 766. [all data]

Terlouw, Heerma, et al., 1974
Terlouw, J.K.; Heerma, W.; Frintrop, P.C.M.; Dijkstra, G.; Meinema, H.A., Electron-impact induced fragmentation of some heterocyclic-tin compounds, J. Organomet. Chem., 1974, 64, 205. [all data]