Cyclopentylcycloheptane

Condensed phase thermochemistry data

Data compiled by: Hussein Y. Afeefy, Joel F. Liebman, and Stephen E. Stein

Quantity Value Units Method Reference Comment
Δcliquid-7640. ± 4.kJ/molCcbKozina, Skuratov, et al., 1961Corresponding Δfliquid = -226. kJ/mol (simple calculation by NIST; no Washburn corrections)

References

Kozina, Skuratov, et al., 1961
Kozina, M.P.; Skuratov, S.M.; Shtekher, S.M.; Sosnina, I.E.; Turova-Polyak, M.B., Heats of combustion of some bicyclanes, Russ. J. Phys. Chem. (Engl. Transl.), 1961, 35, 1144-1146. [all data]