C15HF12N

Reaction thermochemistry data

Data compiled by: John E. Bartmess

Individual Reactions

C15F12N- + Hydrogen cation = C15HF12N

By formula: C15F12N- + H+ = C15HF12N

Quantity Value Units Method Reference Comment
Δr307.5 ± 2.0kcal/molIMREKoppel, Taft, et al., 1994gas phase

Gas phase ion energetics data

Data compiled by: John E. Bartmess

De-protonation reactions

C15F12N- + Hydrogen cation = C15HF12N

By formula: C15F12N- + H+ = C15HF12N

Quantity Value Units Method Reference Comment
Δr307.5 ± 2.0kcal/molIMREKoppel, Taft, et al., 1994gas phase

References

Koppel, Taft, et al., 1994
Koppel, I.A.; Taft, R.W.; Anvia, F.; Zhu, S.Z.; Hu, L.Q.; Sung, K.S.; Desmarteau, D.D.; Yagupolskii, L.M., The Gas-Phase Acidities of Very Strong Neutral Bronsted Acids, J. Am. Chem. Soc., 1994, 116, 7, 3047, https://doi.org/10.1021/ja00086a038 . [all data]