C2H3F3O2S

Reaction thermochemistry data

Data compiled by: John E. Bartmess

Individual Reactions

C2H2F3O2S- + Hydrogen cation = C2H3F3O2S

By formula: C2H2F3O2S- + H+ = C2H3F3O2S

Quantity Value Units Method Reference Comment
Δr1452. ± 8.8kJ/molG+TSTaft, 1987gas phase; value altered from reference due to change in acidity scale
Quantity Value Units Method Reference Comment
Δr1422. ± 8.4kJ/molIMRETaft, 1987gas phase; value altered from reference due to change in acidity scale

Gas phase ion energetics data

Data compiled by: John E. Bartmess

De-protonation reactions

C2H2F3O2S- + Hydrogen cation = C2H3F3O2S

By formula: C2H2F3O2S- + H+ = C2H3F3O2S

Quantity Value Units Method Reference Comment
Δr1452. ± 8.8kJ/molG+TSTaft, 1987gas phase; value altered from reference due to change in acidity scale
Quantity Value Units Method Reference Comment
Δr1422. ± 8.4kJ/molIMRETaft, 1987gas phase; value altered from reference due to change in acidity scale

References

Taft, 1987
Taft, R.W., The Nature and Analysis of Substitutent Electronic Effects, Personal communication. See also Prog. Phys. Org. Chem., 1987, 16, 1. [all data]