N-[(4-butoxyphenyl)methylene]-4-ethoxybenzenamine

Phase change data

Data compiled by: Thermodynamics Research Center, NIST Boulder Laboratories, Chris Muzny director

Quantity Value Units Method Reference Comment
Tfus379.KN/AGrasso, Abate, et al., 1981Nemactic liquid crystal phase; Uncertainty assigned by TRC = 1. K

In addition to the Thermodynamics Research Center (TRC) data available from this site, much more physical and chemical property data is available from the following TRC products:

References

Grasso, Abate, et al., 1981
Grasso, D.; Abate, L.; Fasone, S.; Gandolfo, C.; Siracusa, G., Liquid crystalline properties of some benzylidenanline derivatives, Thermochim. Acta, 1981, 43, 107-110. [all data]