9H-Fluoren-9-one, 3-nitro-

Lee's RI, non-polar column, temperature ramp

View large format table.

Column type Active phase I Reference Comment
CapillarySE-52355.07White, Robbat, et al., 198330. m/0.3 mm/0.25 μm, He, 4. K/min; Tstart: 25. C; Tend: 295. C
CapillarySE-52355.53White, Robbat, et al., 198330. m/0.2 mm/0.25 μm, He, 4. K/min; Tstart: 25. C; Tend: 295. C

Lee's RI, non-polar column, custom temperature program

View large format table.

Column type Active phase I Reference Comment
CapillaryOV-101363.4Tucminen, Wickstrom, et al., 1986Program: not specified

References

White, Robbat, et al., 1983
White, C.M.; Robbat, A., Jr.; Hoes, R.M., Gas chromatographic retention characteristics of nitrated polycyclic aromatic hydrocarbons on SE-52, Chromatographia, 1983, 17, 11, 605-612, https://doi.org/10.1007/BF02261944 . [all data]

Tucminen, Wickstrom, et al., 1986
Tucminen, A.; Wickstrom, K.; Pyysalo, H., Determination of Polycyclic Aromatic Compounds by GLC-Selected Ion Monitoring (SIM) Technique, J. Hi. Res. Chromatogr. Chromatogr. Comm., 1986, 9, 8, 469-471, https://doi.org/10.1002/jhrc.1240090813 . [all data]