peroxypropionic acid

Phase change data

Data compiled as indicated in comments:
AC - William E. Acree, Jr., James S. Chickos
ALS - Hussein Y. Afeefy, Joel F. Liebman, and Stephen E. Stein

Enthalpy of vaporization

ΔvapH (kcal/mol) Temperature (K) Method Reference Comment
10.3288.AStephenson and Malanowski, 1987Based on data from 273. - 393. K. See also Egerton, Emte, et al., 1951 and Dykyj, 1970.; AC
10.320273.VEgerton, Emte, et al., 1951ALS

References

Stephenson and Malanowski, 1987
Stephenson, Richard M.; Malanowski, Stanislaw, Handbook of the Thermodynamics of Organic Compounds, 1987, https://doi.org/10.1007/978-94-009-3173-2 . [all data]

Egerton, Emte, et al., 1951
Egerton, A.C.; Emte, W.; Minkoff, G.J., Some properties of organic peroxides, Faraday Discuss. Chem. Soc., 1951, 10, 278. [all data]

Dykyj, 1970
Dykyj, J., Petrochemica, 1970, 10, 2, 51. [all data]