CAS Reg. No. 42117-12-4

Reaction thermochemistry data

Data compiled by: John E. Bartmess

Individual Reactions

(CAS Reg. No. 42117-12-4 • 42949672952-Propenenitrile) + 2-Propenenitrile = CAS Reg. No. 42117-12-4

By formula: (CAS Reg. No. 42117-12-4 • 4294967295C3H3N) + C3H3N = CAS Reg. No. 42117-12-4

Quantity Value Units Method Reference Comment
Δr57.1 ± 2.2kcal/molN/ABartmess, Scott, et al., 1979gas phase; value altered from reference due to change in acidity scale

References

Bartmess, Scott, et al., 1979
Bartmess, J.E.; Scott, J.A.; McIver, R.T., Jr., The gas phase acidity scale from methanol to phenol, J. Am. Chem. Soc., 1979, 101, 6047. [all data]