3-Hexanol, 3,5-dimethyl-

Normal alkane RI, non-polar column, custom temperature program

View large format table.

Column type Active phase I Reference Comment
CapillaryMethyl Silicone883.Feng and Mu, 2007Program: not specified
CapillaryPolydimethyl siloxane883.Junkes, Castanho, et al., 2003Program: not specified
CapillaryMethyl Silicone883.Estrada and Gutierrez, 1999Program: not specified

References

Feng and Mu, 2007
Feng, H.; Mu, L.-L., Quantitative structure-retention relationships for alkane and its derivatives based on electrotopological state index and molecular shape index, Chem. Ind. Engineering (Chinese), 2007, 24, 2, 161-168. [all data]

Junkes, Castanho, et al., 2003
Junkes, B.S.; Castanho, R.D.M.; Amboni, C.; Yunes, R.A.; Heinzen, V.E.F., Semiempirical Topological Index: A Novel Molecular Descriptor for Quantitative Structure-Retention Relationship Studies, Internet Electronic Journal of Molecular Design, 2003, 2, 1, 33-49. [all data]

Estrada and Gutierrez, 1999
Estrada, E.; Gutierrez, Y., Modeling chromatographic parameters by a novel graph theoretical sub-structural approach, J. Chromatogr. A, 1999, 858, 2, 187-199, https://doi.org/10.1016/S0021-9673(99)00808-0 . [all data]