Sodium p-nitrophenoxide dihydrate

Condensed phase thermochemistry data

Data compiled by: Eugene S. Domalski and Elizabeth D. Hearing

Constant pressure heat capacity of solid

Cp,solid (J/mol*K) Temperature (K) Reference Comment
290.4310.Marchidan and Ciopec, 1978T = 309 to 393 K.

References

Marchidan and Ciopec, 1978
Marchidan, D.I.; Ciopec, M., Relative enthalpies and related thermodynamic functions of some organic compounds by drop calorimetry, J. Therm. Anal., 1978, 14, 131-150. [all data]