tris(3-chlorophenoxy)borane

Phase change data

Data compiled by: William E. Acree, Jr., James S. Chickos

Enthalpy of vaporization

ΔvapH (kJ/mol) Temperature (K) Method Reference Comment
49.6 ± 1.6500.MMWilson and Fenwick, 1973Based on data from 476. - 524. K.

References

Wilson and Fenwick, 1973
Wilson, J.W.; Fenwick, J.T.F., Some thermodynamic properties of some substituted triaryloxyboranes, The Journal of Chemical Thermodynamics, 1973, 5, 3, 341-345, https://doi.org/10.1016/S0021-9614(73)80022-9 . [all data]