F2C=C radical

Vibrational and/or electronic energy levels

Data compiled by: Marilyn E. Jacox

State:   ?

 Energy
 (cm-1
 Med.   Transition   λmin
 (nm)
 λmax
 (nm)

References

Tx = 43860 Ar Breidung, Burger, et al., 1997

State:   ?

 Energy
 (cm-1
 Med.   Transition   λmin
 (nm)
 λmax
 (nm)

Tx = 39370 Ar Breidung, Burger, et al., 1997

State:   a

 Energy
 (cm-1
 Med.   Transition   λmin
 (nm)
 λmax
 (nm)

To = 7455 ± 70 gas Gilles, Lineberger, et al., 1993

State:   X

Vib.
sym.
 No.   Approximate
 type of mode
 cm-1   Med.   Method   References

a1 1 C=C stretch 1670 ± 25 gas PE Gilles, Lineberger, et al., 1993
1 C=C stretch 1672 m Ar IR Breidung, Burger, et al., 1997
2 CF2 s-stretch 905 ± 25 gas PE Gilles, Lineberger, et al., 1993
2 CF2 s-stretch 918 m Ar IR Breidung, Burger, et al., 1997
3 CF2 scissors 510 ± 25 gas PE Gilles, Lineberger, et al., 1993
3 CF2 scissors 511 w Ar IR Breidung, Burger, et al., 1997
b1 4 OPLA 551 w Ar IR Breidung, Burger, et al., 1997
b2 5 CF2 a-stretch 1267 vs Ar IR Breidung, Burger, et al., 1997
6 CF2 rock 334 T Ar IR Breidung, Burger, et al., 1997

Additional references: Jacox, 1994, page 197; Jacox, 2003, page 232

Breidung, Burger, et al., 1997
Breidung, J.; Burger, H.; Kotting, C.; Kopitzky, R.; Sander, W.; Senzlober, M., et al., Difluorvinyliden, F2C«63742»C:, Angew. Chem., 1997, 109, 18, 2072, https://doi.org/10.1002/ange.19971091817 . [all data]

Gilles, Lineberger, et al., 1993
Gilles, M.K.; Lineberger, W.C.; Ervin, K.M., Photoelectron Spectroscopy of the Monofluorovinylidene and Difluorovinylidene Anions: The Monofluorovinylidene-Fluoroacetylene Rearrangement, J. Am. Chem. Soc., 1993, 115, 3, 1031, https://doi.org/10.1021/ja00056a030 . [all data]

Jacox, 1994
Jacox, M.E., Vibrational and electronic energy levels of polyatomic transient molecules, American Chemical Society, Washington, DC, 1994, 464. [all data]

Jacox, 2003
Jacox, M.E., Vibrational and electronic energy levels of polyatomic transient molecules: supplement B, J. Phys. Chem. Ref. Data, 2003, 32, 1, 1-441, https://doi.org/10.1063/1.1497629 . [all data]