Tin, bis[bis(trimethylsilyl)methyl]-

Gas phase ion energetics data

Data compiled by: Sharon G. Lias, Rhoda D. Levin, and Sherif A. Kafafi

Ionization energy determinations

IE (eV) Method Reference Comment
7.42 ± 0.05PEHarris, Lappert, et al., 1976Vertical value

References

Harris, Lappert, et al., 1976
Harris, D.H.; Lappert, M.F.; Pedley, J.B.; Sharp, G.J., Bonding studies of compounds of group 3-5 elements. Part XVIII. He(I) photoelectron spectra of bivalent homoleptic alkyls and amides, especially of group 4 elements, and of tin(II) chloride and bromide, J. Chem. Soc. Dalton Trans., 1976, 945. [all data]