Pyrazine, ethenyl-

Van Den Dool and Kratz RI, non-polar column, custom temperature program

Data compiled by: NIST Mass Spectrometry Data Center, William E. Wallace, director

Column type CapillaryCapillaryCapillaryCapillaryCapillary
Active phase CP Sil 8 CBCP-Sil8DB-5BPX-5DB-5
Column length (m) 60.60.50.50.30.
Carrier gas HeHeHeHeHe
Substrate
Column diameter (mm) 0.250.250.320.320.32
Phase thickness (μm) 0.250.250.50.51.0
Program 40C(2min) => 4C/min => 200C => 10C/min => 250C(15min)40C(2min) => 4C/min => 200C => 10C/min => 250C (15min)oC(5min) => 60C/min => 60C (5min) => 4C/min => 250COC (5min) => 60C/min => 60C(5min) => 4C/min => 250C5 0C (0.5 min) -> (1 min) 60 0C (5 min) 4 0C/min -> 250 0C
I 946.946.947.947.926.
ReferenceMartin and Ames, 2001Martin and Ames, 2001, 2Parker, Hassell, et al., 2000Bredie, Mottram, et al., 1998Beal and Mottram, 1994
Comment MSDC-RI MSDC-RI MSDC-RI MSDC-RI MSDC-RI

References

Martin and Ames, 2001
Martin, F.L.; Ames, J.M., Formation of Strecker aldehydes and pyrazines in a fried potato model system, J. Agric. Food Chem., 2001, 49, 8, 3885-3892, https://doi.org/10.1021/jf010310g . [all data]

Martin and Ames, 2001, 2
Martin, F.L.; Ames, J.M., Comparison of flavor compounds of potato chips fried in palmolein and silicone fluid, J. Amer. Oil Chem. Soc., 2001, 78, 8, 863-866, https://doi.org/10.1007/s11746-001-0356-2 . [all data]

Parker, Hassell, et al., 2000
Parker, J.K.; Hassell, G.M.E.; Mottram, D.S.; Guy, R.C.E., Sensory and instrumental analyses of volatiles generated during the extrusion cooking of oat flours, J. Agric. Food Chem., 2000, 48, 8, 3497-3506, https://doi.org/10.1021/jf991302r . [all data]

Bredie, Mottram, et al., 1998
Bredie, W.L.P.; Mottram, D.S.; Guy, R.C.E., Aroma volatiles generated during extrusion cooking of maize flour, J. Agric. Food Chem., 1998, 46, 4, 1479-1487, https://doi.org/10.1021/jf9708857 . [all data]

Beal and Mottram, 1994
Beal, A.D.; Mottram, D.S., Compounds contributing to the characteristic aroma of malted barley, J. Agric. Food Chem., 1994, 42, 12, 2880-2884, https://doi.org/10.1021/jf00048a043 . [all data]